Build: #1 failed Manual run by Jan Blechta

Build result summary

Details

Completed
Duration
5 minutes
Labels
None
Revisions
dolfinx-next
03905d9931769f3aeca4c265c980c947ab860ce6 03905d9931769f3aeca4c265c980c947ab860ce6
testing
1fac8b226a1b4c408525379af321de3d009f0691 1fac8b226a1b4c408525379af321de3d009f0691
fiat-next-git
5c15f5cc8ddad0f76f13a7d910df7f71c44b4d8b 5c15f5cc8ddad0f76f13a7d910df7f71c44b4d8b
ufl-next-git
631b43a3e99d12dc93e3ca913fcde84a48be8bf3 631b43a3e99d12dc93e3ca913fcde84a48be8bf3
dijitso-next-git
e615aa5ac6a4648d09047158c05e314183e7686d e615aa5ac6a4648d09047158c05e314183e7686d
ffcx-next-git
98fa5b36a355a43e0019618ef46196dd932ab1e0 98fa5b36a355a43e0019618ef46196dd932ab1e0
Total tests
1173

No failed tests found, a possible compilation error occurred.

Responsible

No one has taken responsibility for this failure

Error summary for Build with no optional deps (py3)

The job generated some errors, drill down into the full build log for more details.

usermod: no changes
In file included from /home/fenics/local/src/dolfinx/cpp/dolfin/mesh/DistributedMeshTools.cpp:17:0:
/home/fenics/local/src/dolfinx/cpp/dolfin/graph/SCOTCH.h:49:53: error: ‘SCOTCH_Num’ was not declared in this scope
   partition(const MPI_Comm mpi_comm, const CSRGraph<SCOTCH_Num>& local_graph,
                                                     ^
/home/fenics/local/src/dolfinx/cpp/dolfin/graph/SCOTCH.h:49:63: error: template argument 1 is invalid
   partition(const MPI_Comm mpi_comm, const CSRGraph<SCOTCH_Num>& local_graph,
                                                               ^
make[2]: *** [dolfin/CMakeFiles/dolfin.dir/mesh/DistributedMeshTools.cpp.o] Error 1
make[1]: *** [dolfin/CMakeFiles/dolfin.dir/all] Error 2
make: *** [all] Error 2