Build: #15 failed Manual run by Jan Blechta

Build result summary

Details

Completed
Duration
5 minutes
Labels
None
Revisions
dolfinx
03905d9931769f3aeca4c265c980c947ab860ce6 03905d9931769f3aeca4c265c980c947ab860ce6
fiat-git
e618dfa5dbb3283b9fc03225338255debddc3d15 e618dfa5dbb3283b9fc03225338255debddc3d15
ufl-git
008e0e655d4a757f3f7ac36df521bf2c1f7c75aa 008e0e655d4a757f3f7ac36df521bf2c1f7c75aa
dijitso-git
e615aa5ac6a4648d09047158c05e314183e7686d e615aa5ac6a4648d09047158c05e314183e7686d
testing
1fac8b226a1b4c408525379af321de3d009f0691 1fac8b226a1b4c408525379af321de3d009f0691
ffcx-git
98fa5b36a355a43e0019618ef46196dd932ab1e0 98fa5b36a355a43e0019618ef46196dd932ab1e0
Total tests
1173
Failing since
#3 (Manual run by Jan Blechta)

No failed tests found, a possible compilation error occurred.

Responsible

This build has been failing since #3
No one has taken responsibility

Error summary for Build with no optional deps (py3)

The job generated some errors, drill down into the full build log for more details.

usermod: no changes
In file included from /home/fenics/local/src/dolfinx/cpp/dolfin/mesh/DistributedMeshTools.cpp:17:0:
/home/fenics/local/src/dolfinx/cpp/dolfin/graph/SCOTCH.h:49:53: error: ‘SCOTCH_Num’ was not declared in this scope
   partition(const MPI_Comm mpi_comm, const CSRGraph<SCOTCH_Num>& local_graph,
                                                     ^
/home/fenics/local/src/dolfinx/cpp/dolfin/graph/SCOTCH.h:49:63: error: template argument 1 is invalid
   partition(const MPI_Comm mpi_comm, const CSRGraph<SCOTCH_Num>& local_graph,
                                                               ^
make[2]: *** [dolfin/CMakeFiles/dolfin.dir/mesh/DistributedMeshTools.cpp.o] Error 1
make[1]: *** [dolfin/CMakeFiles/dolfin.dir/all] Error 2
make: *** [all] Error 2