Install and run tests for DOLFIN in a Docker container

Build: #866 failed Rebuilt by Johannes Ring

Build result summary

Details

Completed
Duration
85 minutes
Labels
None
Revisions
dolfin
f73856c4494fd87b0935f9d859a30a75a7fb740c f73856c4494fd87b0935f9d859a30a75a7fb740c
fiat-git
54c4a4ad932c9beae4110250f66aae0fab6d1e47 54c4a4ad932c9beae4110250f66aae0fab6d1e47
ufl-git
7c42c33fc9783d014a5ba6fe5db69bbd542974d5 7c42c33fc9783d014a5ba6fe5db69bbd542974d5
dijitso-git
8812382f98e82b4192d93b935287ea45e6d36b3a 8812382f98e82b4192d93b935287ea45e6d36b3a
ffc-git
e27719048f75bf9fcd16241f4c93948156e1c155 e27719048f75bf9fcd16241f4c93948156e1c155
testing
1fac8b226a1b4c408525379af321de3d009f0691 1fac8b226a1b4c408525379af321de3d009f0691
Total tests
1682
Number of retries
8

No failed tests found, a possible compilation error occurred.

Responsible

Tests

Fixed tests 1
Status Test Failing since View job Duration
Successful test_jit test_compile_extension_module History
Python unit tests (py3) 6 secs

Error summary for Python unit tests mpi (py3)

The job generated some errors, drill down into the full build log for more details.

usermod: no changes
------------------- Start compiler output ------------------------
/tmp/tmppciy73pw/dolfin_expression_df177e01e740968efa8509fe734ada53.cpp: In member function ‘virtual void dolfin::dolfin_expression_df177e01e740968efa8509fe734ada53::eval(Eigen::Ref<Eigen::Matrix<double, -1, 1> >, Eigen::Ref<const Eigen::Matrix<double, -1, 1> >) const’:
/tmp/tmppciy73pw/dolfin_expression_df177e01e740968efa8509fe734ada53.cpp:61:23: error: ‘a’ was not declared in this scope
           values[0] = a;
                       ^

-------------------  End compiler output  ------------------------
Compilation failed! Sources, command, and errors have been written to: /home/fenics/local/src/dolfin/python/test/unit/jitfailure-dolfin_expression_df177e01e740968efa8509fe734ada53
------------------- Start compiler output ------------------------
/tmp/tmp8a_pvmjd/dolfin_expression_2e32957b863c0ad3401d86fcc7b9efec.cpp: In member function ‘virtual void dolfin::dolfin_expression_2e32957b863c0ad3401d86fcc7b9efec::eval(Eigen::Ref<Eigen::Matrix<double, -1, 1> >, Eigen::Ref<const Eigen::Matrix<double, -1, 1> >) const’:
/tmp/tmp8a_pvmjd/dolfin_expression_2e32957b863c0ad3401d86fcc7b9efec.cpp:61:23: error: ‘a’ was not declared in this scope
           values[0] = a;
                       ^

-------------------  End compiler output  ------------------------
Compilation failed! Sources, command, and errors have been written to: /home/fenics/local/src/dolfin/python/test/unit/jitfailure-dolfin_expression_2e32957b863c0ad3401d86fcc7b9efec
------------------- Start compiler output ------------------------
/tmp/tmpozk_s9p2/dolfin_expression_c3bd7b8ae341127a76a288f999df22d6.cpp: In member function ‘virtual void dolfin::dolfin_expression_c3bd7b8ae341127a76a288f999df22d6::eval(Eigen::Ref<Eigen::Matrix<double, -1, 1> >, Eigen::Ref<const Eigen::Matrix<double, -1, 1> >) const’:
/tmp/tmpozk_s9p2/dolfin_expression_c3bd7b8ae341127a76a288f999df22d6.cpp:62:23: error: ‘foo’ was not declared in this scope
           values[0] = foo;
                       ^~~

-------------------  End compiler output  ------------------------
Compilation failed! Sources, command, and errors have been written to: /home/fenics/local/src/dolfin/python/test/unit/jitfailure-dolfin_expression_c3bd7b8ae341127a76a288f999df22d6
------------------- Start compiler output ------------------------
/tmp/tmp_345qbh7/dolfin_expression_f0277da26e07a0cf148cc0108d335715.cpp: In member function ‘virtual void dolfin::dolfin_expression_f0277da26e07a0cf148cc0108d335715::eval(Eigen::Ref<Eigen::Matrix<double, -1, 1> >, Eigen::Ref<const Eigen::Matrix<double, -1, 1> >) const’:
/tmp/tmp_345qbh7/dolfin_expression_f0277da26e07a0cf148cc0108d335715.cpp:61:23: error: expected primary-expression before ‘/’ token
           values[0] = /;
                       ^
/tmp/tmp_345qbh7/dolfin_expression_f0277da26e07a0cf148cc0108d335715.cpp:61:24: error: expected primary-expression before ‘;’ token
           values[0] = /;
                        ^

-------------------  End compiler output  ------------------------
Compilation failed! Sources, command, and errors have been written to: /home/fenics/local/src/dolfin/python/test/unit/jitfailure-dolfin_expression_f0277da26e07a0cf148cc0108d335715
------------------- Start compiler output ------------------------
/tmp/tmp5ax4l66l/dolfin_expression_d920884676ae8362e3b5397a577ca1d9.cpp: In member function ‘virtual void dolfin::dolfin_expression_d920884676ae8362e3b5397a577ca1d9::eval(Eigen::Ref<Eigen::Matrix<double, -1, 1> >, Eigen::Ref<const Eigen::Matrix<double, -1, 1> >) const’:
/tmp/tmp5ax4l66l/dolfin_expression_d920884676ae8362e3b5397a577ca1d9.cpp:61:23: error: ‘t’ was not declared in this scope
           values[0] = t;
                       ^
/tmp/tmp5ax4l66l/dolfin_expression_d920884676ae8362e3b5397a577ca1d9.cpp:61:23: note: suggested alternative: ‘tm’
           values[0] = t;
                       ^
                       tm

-------------------  End compiler output  ------------------------
Compilation failed! Sources, command, and errors have been written to: /home/fenics/local/src/dolfin/python/test/unit/jitfailure-dolfin_expression_d920884676ae8362e3b5397a577ca1d9
geninfo: WARNING: no .gcda files found in . - skipping!
lcov: ERROR: no valid records found in tracefile all.info