Install and run tests for DOLFIN in a Docker container

Build result summary

Details

Completed
Duration
245 minutes
Labels
None
Revisions
dolfin
8ccef27841c14f75ba5f3e05c8661bd19f88098c 8ccef27841c14f75ba5f3e05c8661bd19f88098c
fiat-git
54c4a4ad932c9beae4110250f66aae0fab6d1e47 54c4a4ad932c9beae4110250f66aae0fab6d1e47
ufl-git
42e14c18c79453fc0ab43dd3498e81501e450741 42e14c18c79453fc0ab43dd3498e81501e450741
dijitso-git
8812382f98e82b4192d93b935287ea45e6d36b3a 8812382f98e82b4192d93b935287ea45e6d36b3a
ffc-git
e27719048f75bf9fcd16241f4c93948156e1c155 e27719048f75bf9fcd16241f4c93948156e1c155
testing
1fac8b226a1b4c408525379af321de3d009f0691 1fac8b226a1b4c408525379af321de3d009f0691
Total tests
1682
Failing since
#868 (Changes by Drew Parsons <dparsons@debian.org> and Drew Parsons <dparsons@emerall.com>)

No failed tests found, a possible compilation error occurred.

Responsible

This build has been failing since #868
No one has taken responsibility

Code commits

ufl-git
Author Commit Message Commit date
Lawrence Mitchell &lt;lawrence@wence.uk&gt; Lawrence Mitchell <lawrence@wence.uk> 42e14c18c79453fc0ab43dd3498e81501e450741 42e14c18c79453fc0ab43dd3498e81501e450741 Merged in fix-degree-estimation (pull request #109)
* fix-degree-estimation:
  better degree estimation for non-affine meshes
Tuomas Karna &lt;tuomas.karna@gmail.com&gt; Tuomas Karna <tuomas.karna@gmail.com> f5b84673e1c562f67f453b6f9916329535e5ae21 f5b84673e1c562f67f453b6f9916329535e5ae21 better degree estimation for non-affine meshes
See UFL issue #80.

Error summary for Python unit tests mpi (py3)

The job generated some errors, drill down into the full build log for more details.

usermod: no changes
------------------- Start compiler output ------------------------
/tmp/tmp7lh9bi4w/dolfin_expression_df177e01e740968efa8509fe734ada53.cpp: In member function ‘virtual void dolfin::dolfin_expression_df177e01e740968efa8509fe734ada53::eval(Eigen::Ref<Eigen::Matrix<double, -1, 1> >, Eigen::Ref<const Eigen::Matrix<double, -1, 1> >) const’:
/tmp/tmp7lh9bi4w/dolfin_expression_df177e01e740968efa8509fe734ada53.cpp:61:23: error: ‘a’ was not declared in this scope
           values[0] = a;
                       ^

-------------------  End compiler output  ------------------------
Compilation failed! Sources, command, and errors have been written to: /home/fenics/local/src/dolfin/python/test/unit/jitfailure-dolfin_expression_df177e01e740968efa8509fe734ada53
------------------- Start compiler output ------------------------
/tmp/tmplr2gd3e6/dolfin_expression_2e32957b863c0ad3401d86fcc7b9efec.cpp: In member function ‘virtual void dolfin::dolfin_expression_2e32957b863c0ad3401d86fcc7b9efec::eval(Eigen::Ref<Eigen::Matrix<double, -1, 1> >, Eigen::Ref<const Eigen::Matrix<double, -1, 1> >) const’:
/tmp/tmplr2gd3e6/dolfin_expression_2e32957b863c0ad3401d86fcc7b9efec.cpp:61:23: error: ‘a’ was not declared in this scope
           values[0] = a;
                       ^

-------------------  End compiler output  ------------------------
Compilation failed! Sources, command, and errors have been written to: /home/fenics/local/src/dolfin/python/test/unit/jitfailure-dolfin_expression_2e32957b863c0ad3401d86fcc7b9efec
------------------- Start compiler output ------------------------
/tmp/tmp5i6gmemw/dolfin_expression_c3bd7b8ae341127a76a288f999df22d6.cpp: In member function ‘virtual void dolfin::dolfin_expression_c3bd7b8ae341127a76a288f999df22d6::eval(Eigen::Ref<Eigen::Matrix<double, -1, 1> >, Eigen::Ref<const Eigen::Matrix<double, -1, 1> >) const’:
/tmp/tmp5i6gmemw/dolfin_expression_c3bd7b8ae341127a76a288f999df22d6.cpp:62:23: error: ‘foo’ was not declared in this scope
           values[0] = foo;
                       ^~~

-------------------  End compiler output  ------------------------
Compilation failed! Sources, command, and errors have been written to: /home/fenics/local/src/dolfin/python/test/unit/jitfailure-dolfin_expression_c3bd7b8ae341127a76a288f999df22d6
------------------- Start compiler output ------------------------
/tmp/tmpazer6z54/dolfin_expression_f0277da26e07a0cf148cc0108d335715.cpp: In member function ‘virtual void dolfin::dolfin_expression_f0277da26e07a0cf148cc0108d335715::eval(Eigen::Ref<Eigen::Matrix<double, -1, 1> >, Eigen::Ref<const Eigen::Matrix<double, -1, 1> >) const’:
/tmp/tmpazer6z54/dolfin_expression_f0277da26e07a0cf148cc0108d335715.cpp:61:23: error: expected primary-expression before ‘/’ token
           values[0] = /;
                       ^
/tmp/tmpazer6z54/dolfin_expression_f0277da26e07a0cf148cc0108d335715.cpp:61:24: error: expected primary-expression before ‘;’ token
           values[0] = /;
                        ^

-------------------  End compiler output  ------------------------
Compilation failed! Sources, command, and errors have been written to: /home/fenics/local/src/dolfin/python/test/unit/jitfailure-dolfin_expression_f0277da26e07a0cf148cc0108d335715
------------------- Start compiler output ------------------------
/tmp/tmpuidzr86h/dolfin_expression_d920884676ae8362e3b5397a577ca1d9.cpp: In member function ‘virtual void dolfin::dolfin_expression_d920884676ae8362e3b5397a577ca1d9::eval(Eigen::Ref<Eigen::Matrix<double, -1, 1> >, Eigen::Ref<const Eigen::Matrix<double, -1, 1> >) const’:
/tmp/tmpuidzr86h/dolfin_expression_d920884676ae8362e3b5397a577ca1d9.cpp:61:23: error: ‘t’ was not declared in this scope
           values[0] = t;
                       ^
/tmp/tmpuidzr86h/dolfin_expression_d920884676ae8362e3b5397a577ca1d9.cpp:61:23: note: suggested alternative: ‘tm’
           values[0] = t;
                       ^
                       tm

-------------------  End compiler output  ------------------------
Compilation failed! Sources, command, and errors have been written to: /home/fenics/local/src/dolfin/python/test/unit/jitfailure-dolfin_expression_d920884676ae8362e3b5397a577ca1d9