Install and run tests for FIAT in a Docker container
None

Plan summary

Current activity

No builds are currently running.

Recent history

Status Reason Completed Test results Flags
#94 Manual run by Johannes Ring 2 weeks ago 2 of 7 failed
#93 Manual run by Johannes Ring 2 weeks ago 2 of 7 failed
#92 Rebuilt by Johannes Ring 2 weeks ago 2 of 7 failed

Error log

    Unable to detect changes

    (21 Feb 2019, 11:33:54 AM)

    Repository error while detecting branches for plan FIAT-FD. com.atlassian.bamboo.plugins.git.GitCommandException: command /usr/bin/git ls-remote https://bitbucket.org/fenics-project/fiat failed with code 128. Working directory was [/home/bamboo/atlassian-bamboo-current/temp]., stderr:
    fatal: unable to access 'https://bitbucket.org/fenics-project/fiat/': Could not resolve host: bitbucket.org

    (19 Mar 2019, 2:53:27 PM, Occurrences: 7)

    Unable to detect changes

    (15 Mar 2019, 12:40:47 AM, Occurrences: 7)

    Repository error while detecting branches for plan FIAT-FD. com.atlassian.bamboo.plugins.git.GitCommandException: command /usr/bin/git ls-remote https://bitbucket.org/fenics-project/fiat failed with code 128. Working directory was [/home/bamboo/atlassian-bamboo-current/temp]., stderr:
    fatal: unable to access 'https://bitbucket.org/fenics-project/fiat/': gnutls_handshake() failed: An unexpected TLS packet was received.

    (02 Mar 2019, 9:38:49 PM)

    Repository error while detecting branches for plan FIAT-FD. com.atlassian.bamboo.plugins.git.GitCommandException: command /usr/bin/git ls-remote https://bitbucket.org/fenics-project/fiat failed with code 128. Working directory was [/home/bamboo/atlassian-bamboo-current/temp]., stderr:
    remote: Repo location could not be resolved
    fatal: unable to access 'https://bitbucket.org/fenics-project/fiat/': The requested URL returned error: 500

    (07 Mar 2019, 12:45:48 AM)

Plan statistics

  • 3 builds
  • 0% successful
  • 1m average duration

'FIAT - FIAT docker' all builds RSS feed Feed for all builds or just the failed builds.